BDBM50054497 CHEMBL141043::N-((S)-3-Carbamimidoyl-2-hydroxy-cyclohexyl)-2-((S)-2-oxo-3-phenylacetylamino-piperidin-1-yl)-acetamide
SMILES NC(=N)C1CCC[C@H](NC(=O)CN2CCC[C@H](NC(=O)Cc3ccccc3)C2=O)C1O
InChI Key InChIKey=BKVLBBMLAVIGDR-ASPXRTSYSA-N
Data  2 IC50
  Tab Delimited (TSV)   2D SDfile   Computed 3D by Vconf -m prep SDfile
Find this compound or compounds like it in BindingDB:
Activity Spreadsheet -- Enzyme Inhibition Constant Data from BindingDB
Found 2 hits for monomerid = 50054497
TargetAnionic trypsin(Bos taurus)
Corvas International
Curated by ChEMBL
LigandPNGBDBM50054497(CHEMBL141043 | N-((S)-3-Carbamimidoyl-2-hydroxy-cy...)
Affinity DataIC50: >2.50E+3nM. Assay description: compound was tested in vitro for inhibition of serine protease Trypsin.
In DepthDetails ArticlePubMed
TargetProthrombin(Homo sapiens (Human))
Corvas International
Curated by ChEMBL
LigandPNGBDBM50054497(CHEMBL141043 | N-((S)-3-Carbamimidoyl-2-hydroxy-cy...)
Affinity DataIC50:  2.50E+3nM. Assay description: In vitro for inhibition of serine protease thrombin(FIIa).
In DepthDetails ArticlePubMed