BDBM50054630 3-(Cyclopentyl-phenyl-methyl)-4-hydroxy-6,6-dipropyl-5,6-dihydro-pyran-2-one::CHEMBL143550
SMILES CCCC1(CCC)CC(=O)C(C(C2CCCC2)c2ccccc2)C(=O)O1
InChI Key InChIKey=IKFCQUBSBRPKID-UHFFFAOYSA-N
Data  1 KI
  Tab Delimited (TSV)   2D SDfile   Computed 3D by Vconf -m prep SDfile
Find this compound or compounds like it in BindingDB:
Activity Spreadsheet -- Enzyme Inhibition Constant Data from BindingDB
Found 1 hit for monomerid = 50054630
TargetGag-Pol polyprotein [489-587](Human immunodeficiency virus type 1)
Pharmacia & Upjohn
Curated by ChEMBL
LigandPNGBDBM50054630(3-(Cyclopentyl-phenyl-methyl)-4-hydroxy-6,6-diprop...)
Affinity DataKi:  39nM. Assay description: HIV Protease inhibitory activity
In DepthDetails ArticlePubMed