BDBM50054908 2-[2-[2-[Acetyl-(4-fluoro-phenyl)-amino]-3-(4-fluoro-phenyl)-propionylamino]-3-(4-guanidino-phenyl)-propionylamino]-4-methyl-pentanoic acid (1-carbamoyl-4-guanidino-butyl)-amide::CHEMBL147872
SMILES [#6]-[#6](-[#6])-[#6]-[#6](-[#7]-[#6](=O)-[#6](-[#6]-c1ccc(cc1)\[#7]=[#6](\[#7])-[#7])-[#7]-[#6](=O)-[#6](-[#6]-c1ccc(F)cc1)-[#7](-[#6](-[#6])=O)-c1ccc(F)cc1)-[#6](=O)-[#7]-[#6](-[#6]-[#6]-[#6]-[#7]-[#6](-[#7])=[#7])-[#6](-[#7])=O
InChI Key InChIKey=ASMUJLLIYBYWGO-UHFFFAOYSA-N
Data  2 IC50
  Tab Delimited (TSV)   2D SDfile   Computed 3D by Vconf -m prep SDfile
Find this compound or compounds like it in BindingDB:
Activity Spreadsheet -- Enzyme Inhibition Constant Data from BindingDB
Found 2 hits for monomerid = 50054908
TargetProteinase-activated receptor 1(Homo sapiens (Human))
Bristol-Myers Squibb Pharmaceutical Research Institute
Curated by ChEMBL
LigandPNGBDBM50054908(2-[2-[2-[Acetyl-(4-fluoro-phenyl)-amino]-3-(4-fluo...)
Affinity DataIC50:  6.80E+4nM. Assay description: Concentration required to inhibit agonist (SFFLRR-NH2, at 3 uM) induced platelet aggregation by 50%
In DepthDetails ArticlePubMed
TargetProteinase-activated receptor 1(Homo sapiens (Human))
Bristol-Myers Squibb Pharmaceutical Research Institute
Curated by ChEMBL
LigandPNGBDBM50054908(2-[2-[2-[Acetyl-(4-fluoro-phenyl)-amino]-3-(4-fluo...)
Affinity DataIC50:  350nM. Assay description: Antagonistic activity against tritiated agonist (SFFLRR-NH2, at 25 nM) binding to human platelet membranes measured by the GTPase assay
In DepthDetails ArticlePubMed