BDBM50054923 CHEMBL3326779
SMILES O=c1n(N2CCOCC2)c(CSc2ncnc3[nH]cnc23)nc2ccccc12
InChI Key InChIKey=SQMPUCYQFAPBHU-UHFFFAOYSA-N
Data  1 IC50
  Tab Delimited (TSV)   2D SDfile   Computed 3D by Vconf -m prep SDfile
Find this compound or compounds like it in BindingDB:
Activity Spreadsheet -- Enzyme Inhibition Constant Data from BindingDB
Found 1 hit for monomerid = 50054923
TargetPhosphatidylinositol 4,5-bisphosphate 3-kinase catalytic subunit gamma isoform(Homo sapiens (Human))
The University Of Jordan
Curated by ChEMBL
LigandPNGBDBM50054923(CHEMBL3326779)
Affinity DataIC50:  1.38E+5nM. Assay description: Inhibition of PI3Kgamma (unknown origin) assessed as decrease in fluorescence intensity using phosphorylated substrate
In DepthDetails ArticlePubMed