BDBM50054945 CHEMBL144594::Furan-3-carboxylic acid [1-[1-[1-(1-carbamoyl-4-guanidino-butylcarbamoyl)-3-methyl-butylcarbamoyl]-2-(4-guanidino-phenyl)-ethylcarbamoyl]-2-(4-fluoro-phenyl)-ethyl]-amide
SMILES [#6]-[#6](-[#6])-[#6]-[#6](-[#7]-[#6](=O)-[#6](-[#6]-c1ccc(cc1)\[#7]=[#6](\[#7])-[#7])-[#7]-[#6](=O)-[#6](-[#6]-c1ccc(F)cc1)-[#7]-[#6](=O)-c1ccoc1)-[#6](=O)-[#7]-[#6](-[#6]-[#6]-[#6]-[#7]-[#6](-[#7])=[#7])-[#6](-[#7])=O
InChI Key InChIKey=YAOFXIQXDLBIFI-UHFFFAOYSA-N
Data  1 IC50
  Tab Delimited (TSV)   2D SDfile   Computed 3D by Vconf -m prep SDfile
Find this compound or compounds like it in BindingDB:
Activity Spreadsheet -- Enzyme Inhibition Constant Data from BindingDB
Found 1 hit for monomerid = 50054945
TargetProteinase-activated receptor 1(Homo sapiens (Human))
Bristol-Myers Squibb Pharmaceutical Research Institute
Curated by ChEMBL
LigandPNGBDBM50054945(CHEMBL144594 | Furan-3-carboxylic acid [1-[1-[1-(1...)
Affinity DataIC50:  29nM. Assay description: Antagonistic activity against tritiated agonist (SFFLRR-NH2, at 25 nM) binding to human platelet membranes measured by the GTPase assay
In DepthDetails ArticlePubMed