BDBM50055014 7-(3,4-Dichloro-phenyl)-2,4,5,7-tetrahydro-3H-[1,3]diazepino[2,1-a]isoindol-7-ol::CHEMBL337510
SMILES OC1(N2CCCCN=C2c2ccccc12)c1ccc(Cl)c(Cl)c1
InChI Key InChIKey=JDGHEGQYEARKKK-UHFFFAOYSA-N
Data  3 IC50
  Tab Delimited (TSV)   2D SDfile   Computed 3D by Vconf -m prep SDfile
Find this compound or compounds like it in BindingDB:
Activity Spreadsheet -- Enzyme Inhibition Constant Data from BindingDB
Found 3 hits for monomerid = 50055014
TargetSodium-dependent dopamine transporter(Rattus norvegicus (rat))
Drew University
Curated by ChEMBL
LigandPNGBDBM50055014(7-(3,4-Dichloro-phenyl)-2,4,5,7-tetrahydro-3H-[1,3...)
Affinity DataIC50:  0.260nM. Assay description: Inhibition of [3H]-dopamine uptake at the dopamine transporter in rat striatal tissue
In DepthDetails ArticlePubMed
TargetSodium-dependent dopamine transporter(Rattus norvegicus (rat))
Drew University
Curated by ChEMBL
LigandPNGBDBM50055014(7-(3,4-Dichloro-phenyl)-2,4,5,7-tetrahydro-3H-[1,3...)
Affinity DataIC50:  1.70nM. Assay description: Ability to displace [3H]-WIN-35,428 from dopamine transporter in rat caudate putamen tissue
In DepthDetails ArticlePubMed
TargetSodium-dependent dopamine transporter(Rattus norvegicus (rat))
Drew University
Curated by ChEMBL
LigandPNGBDBM50055014(7-(3,4-Dichloro-phenyl)-2,4,5,7-tetrahydro-3H-[1,3...)
Affinity DataIC50:  1.70nM. Assay description: Inhibition of [3H]-WIN- 35,428 binding to the dopamine transporter in rat brain
In DepthDetails ArticlePubMed