BDBM50055015 6-(3-Fluoro-phenyl)-2,3,4,6-tetrahydro-pyrimido[2,1-a]isoindol-6-ol::9-(3-Fluoro-phenyl)-1,2,3,9-tetrahydro-4,9a-diaza-fluoren-9-ol::CHEMBL133795
SMILES OC1(N2CCCN=C2c2ccccc12)c1cccc(F)c1
InChI Key InChIKey=RPQJLSMUWJSEBE-UHFFFAOYSA-N
Data  3 IC50
  Tab Delimited (TSV)   2D SDfile   Computed 3D by Vconf -m prep SDfile
Find this compound or compounds like it in BindingDB:
Activity Spreadsheet -- Enzyme Inhibition Constant Data from BindingDB
Found 3 hits for monomerid = 50055015
TargetSodium-dependent dopamine transporter(Rattus norvegicus (rat))
Drew University
Curated by ChEMBL
LigandPNGBDBM50055015(6-(3-Fluoro-phenyl)-2,3,4,6-tetrahydro-pyrimido[2,...)
Affinity DataIC50:  3.10nM. Assay description: Inhibition of [3H]-dopamine uptake at the dopamine transporter in rat striatal tissue
In DepthDetails ArticlePubMed
TargetSodium-dependent dopamine transporter(Rattus norvegicus (rat))
Drew University
Curated by ChEMBL
LigandPNGBDBM50055015(6-(3-Fluoro-phenyl)-2,3,4,6-tetrahydro-pyrimido[2,...)
Affinity DataIC50:  2nM. Assay description: Ability to displace [3H]-WIN-35,428 from dopamine transporter in rat caudate putamen tissue
In DepthDetails ArticlePubMed
TargetSodium-dependent dopamine transporter(Rattus norvegicus (rat))
Drew University
Curated by ChEMBL
LigandPNGBDBM50055015(6-(3-Fluoro-phenyl)-2,3,4,6-tetrahydro-pyrimido[2,...)
Affinity DataIC50:  2nM. Assay description: Inhibition of [3H]-WIN- 35,428 binding to the dopamine transporter in rat brain
In DepthDetails ArticlePubMed