BDBM50055028 1-[4-(2-Amino-ethoxy)-3-methoxy-benzyl]-3-(4-tert-butyl-benzyl)-thiourea::CHEMBL356291
SMILES COc1cc(CNC(=S)NCc2ccc(cc2)C(C)(C)C)ccc1OCCN
InChI Key InChIKey=CRYDRZCVOYLUOV-UHFFFAOYSA-N
Data  1 KI  2 EC50
  Tab Delimited (TSV)   2D SDfile   Computed 3D by Vconf -m prep SDfile
Find this compound or compounds like it in BindingDB:
Activity Spreadsheet -- Enzyme Inhibition Constant Data from BindingDB
Found 3 hits for monomerid = 50055028
TargetTransient receptor potential cation channel subfamily V member 1(Rattus norvegicus (rat))
Seoul National University
Curated by ChEMBL
LigandPNGBDBM50055028(1-[4-(2-Amino-ethoxy)-3-methoxy-benzyl]-3-(4-tert-...)
Affinity DataKi:  84nM. Assay description: Displacement of [3H]RTX from rat TRPV1 expressed in CHO cells
In DepthDetails ArticlePubMed
TargetTransient receptor potential cation channel subfamily V member 1/2/4(Rattus norvegicus)
Sandoz Institute For Medical Research
Curated by ChEMBL
LigandPNGBDBM50055028(1-[4-(2-Amino-ethoxy)-3-methoxy-benzyl]-3-(4-tert-...)
Affinity DataEC50:  170nM. Assay description: Compound tested in vitro for [Ca2+] influx into neonatal rat dorsal root ganglia (DRG)
In DepthDetails ArticlePubMed
TargetTransient receptor potential cation channel subfamily V member 1(Rattus norvegicus (rat))
Seoul National University
Curated by ChEMBL
LigandPNGBDBM50055028(1-[4-(2-Amino-ethoxy)-3-methoxy-benzyl]-3-(4-tert-...)
Affinity DataEC50:  132nM. Assay description: Agonist activity at rat TRPV1 expressed in CHO cells assessed as calcium uptake
In DepthDetails ArticlePubMed