BDBM50055045 CHEMBL3323243
SMILES [H][C@@]1(OC(=O)c2c1ccc(OC)c2OC)[C@]1([H])N(C)CCc2c(c3OCOc3c(OC)c12)-c1ccc(C)cc1
InChI Key InChIKey=JTHRHOZIDJQLSO-RPWUZVMVSA-N
Data  2 IC50
  Tab Delimited (TSV)   2D SDfile   Computed 3D by Vconf -m prep SDfile
Find this compound or compounds like it in BindingDB:
Activity Spreadsheet -- Enzyme Inhibition Constant Data from BindingDB
Found 2 hits for monomerid = 50055045
TargetSimilar to alpha-tubulin isoform 1(Bos taurus)
University Of Padova
Curated by ChEMBL
LigandPNGBDBM50055045(CHEMBL3323243)
Affinity DataIC50:  4.50E+4nM. Assay description: Inhibition of bovine brain tubulin assessed as rate of assembly preincubated for 15 mins by turbidimetry
In DepthDetails ArticlePubMed
TargetSimilar to alpha-tubulin isoform 1(Bos taurus)
University Of Padova
Curated by ChEMBL
LigandPNGBDBM50055045(CHEMBL3323243)
Affinity DataIC50:  1.20E+5nM. Assay description: Inhibition of bovine brain tubulin assessed as extent of assembly preincubated for 15 mins by turbidimetry
In DepthDetails ArticlePubMed