BDBM50055182 CHEMBL3323610
SMILES FC(F)(F)c1ccc(cc1)-c1nc2ccc(Nc3ccnc4ccccc34)cc2[nH]1
InChI Key InChIKey=NZDFWWIUSSISBZ-UHFFFAOYSA-N
Data  1 IC50
  Tab Delimited (TSV)   2D SDfile   Computed 3D by Vconf -m prep SDfile
Find this compound or compounds like it in BindingDB:
Activity Spreadsheet -- Enzyme Inhibition Constant Data from BindingDB
Found 1 hit for monomerid = 50055182
TargetVascular endothelial growth factor receptor 2(Homo sapiens (Human))
China Pharmaceutical University
Curated by ChEMBL
LigandPNGBDBM50055182(CHEMBL3323610)
Affinity DataIC50: >1.00E+4nM. Assay description: Inhibition of VEGFR2 (unknown origin) using ATP/substrate peptide after 1 hr by colorimetric ELISA
In DepthDetails ArticlePubMed