BDBM50055299 4-(1-Benzyl-3-carbamoylmethyl-2-ethyl-1H-indol-5-ylsulfanyl)-butyric acid::CHEMBL345756
SMILES CCc1c(CC(N)=O)c2cc(SCCCC(O)=O)ccc2n1Cc1ccccc1
InChI Key InChIKey=RGAUVAINCRFLMV-UHFFFAOYSA-N
Data  1 IC50
  Tab Delimited (TSV)   2D SDfile   Computed 3D by Vconf -m prep SDfile
Find this compound or compounds like it in BindingDB:
Activity Spreadsheet -- Enzyme Inhibition Constant Data from BindingDB
Found 1 hit for monomerid = 50055299
TargetPhospholipase A2, membrane associated(Homo sapiens (Human))
Eli Lilly
Curated by ChEMBL
LigandPNGBDBM50055299(4-(1-Benzyl-3-carbamoylmethyl-2-ethyl-1H-indol-5-y...)
Affinity DataIC50:  23nM. Assay description: Inhibition of human non-pancreatic secretory phospholipase A2 (PLA2) in a chromogenic assay
In DepthDetails ArticlePubMed