BDBM50055344 4-(3-Carbamoylmethyl-1-cyclohexylmethyl-2-methyl-1H-indol-5-yloxy)-butyric acid::CHEMBL146055
SMILES Cc1c(CC(N)=O)c2cc(OCCCC(O)=O)ccc2n1CC1CCCCC1
InChI Key InChIKey=AHHIMFVWOKPPRS-UHFFFAOYSA-N
Data  1 IC50
  Tab Delimited (TSV)   2D SDfile   Computed 3D by Vconf -m prep SDfile
Find this compound or compounds like it in BindingDB:
Activity Spreadsheet -- Enzyme Inhibition Constant Data from BindingDB
Found 1 hit for monomerid = 50055344
TargetPhospholipase A2, membrane associated(Homo sapiens (Human))
Eli Lilly
Curated by ChEMBL
LigandPNGBDBM50055344(4-(3-Carbamoylmethyl-1-cyclohexylmethyl-2-methyl-1...)
Affinity DataIC50:  654nM. Assay description: Inhibition of human non-pancreatic secretory phospholipase A2 (PLA2) in a chromogenic assay
In DepthDetails ArticlePubMed