BDBM50055485 16-(Isoxazol-3-yloxymethyl)-5,9,12,13-tetramethyl-4-oxa-tricyclo[10.3.1.0*3,5*]hexadec-8-en-2-ol::CHEMBL150968
SMILES C[C@@H]1CC[C@@H]2[C@H](C=O)[C@@]1(C)CC[C@]1(C)O[C@H]1CC[C@@]1(C)O[C@@H]1C2=O
InChI Key InChIKey=ZPBAUHKQXIEUFB-DQAPRGMSSA-N
Data  1 IC50
  Tab Delimited (TSV)   2D SDfile   Computed 3D by Vconf -m prep SDfile
Find this compound or compounds like it in BindingDB:
Activity Spreadsheet -- Enzyme Inhibition Constant Data from BindingDB
Found 1 hit for monomerid = 50055485
TargetPlatelet-activating factor receptor(Cavia porcellus)
Sankyo
Curated by ChEMBL
LigandPNGBDBM50055485(16-(Isoxazol-3-yloxymethyl)-5,9,12,13-tetramethyl-...)
Affinity DataIC50:  1.70E+4nM. Assay description: Inhibiting Platelet activating factor receptor by radioreceptor binding assay using rabbit platelets and [3H]-PAF
In DepthDetails ArticlePubMed