BDBM50055515 CHEMBL3317818
SMILES CC(C)(C)OC(=O)n1cnc(C[C@@H]2NC(=O)[C@]3(C)CSC(=N3)c3csc(CNC(=O)C[C@H](OC2=O)\C=C\CCS)n3)c1
InChI Key InChIKey=ZZWAMCDLANIKAG-JJNYADFFSA-N
Data  4 IC50
  Tab Delimited (TSV)   2D SDfile   Computed 3D by Vconf -m prep SDfile
Find this compound or compounds like it in BindingDB:
Activity Spreadsheet -- Enzyme Inhibition Constant Data from BindingDB
Found 4 hits for monomerid = 50055515
TargetHistone deacetylase 1(Homo sapiens (Human))
Duke University
Curated by ChEMBL
LigandPNGBDBM50055515(CHEMBL3317818)
Affinity DataIC50:  0.620nM. Assay description: Inhibition of HDAC1 (unknown origin) incubated at 37 degC for 30 mins
In DepthDetails ArticlePubMed
TargetHistone deacetylase 8(Homo sapiens (Human))
Duke University
Curated by ChEMBL
LigandPNGBDBM50055515(CHEMBL3317818)
Affinity DataIC50:  540nM. Assay description: Inhibition of HDAC8 (unknown origin) incubated at 37 degC for 30 mins
In DepthDetails ArticlePubMed
TargetHistone deacetylase 3(Homo sapiens (Human))
Duke University
Curated by ChEMBL
LigandPNGBDBM50055515(CHEMBL3317818)
Affinity DataIC50:  1.10nM. Assay description: Inhibition of HDAC3 (unknown origin) incubated at 37 degC for 30 mins
In DepthDetails ArticlePubMed
TargetHistone deacetylase 2(Homo sapiens (Human))
Duke University
Curated by ChEMBL
LigandPNGBDBM50055515(CHEMBL3317818)
Affinity DataIC50:  1.10nM. Assay description: Inhibition of HDAC2 (unknown origin) incubated at 37 degC for 30 mins
In DepthDetails ArticlePubMed