BDBM50055745 CHEMBL348681::[1-(3-Hydroxy-benzyl)-5-methoxy-2-methyl-1H-indol-3-yl]-acetic acid hydrazide
SMILES COc1ccc2n(Cc3cccc(O)c3)c(C)c(CC(=O)NN)c2c1
InChI Key InChIKey=AJAUJPWVSXHLLJ-UHFFFAOYSA-N
Data  1 IC50
  Tab Delimited (TSV)   2D SDfile   Computed 3D by Vconf -m prep SDfile
Find this compound or compounds like it in BindingDB:
Activity Spreadsheet -- Enzyme Inhibition Constant Data from BindingDB
Found 1 hit for monomerid = 50055745
TargetPhospholipase A2, membrane associated(Homo sapiens (Human))
Eli Lilly
Curated by ChEMBL
LigandPNGBDBM50055745(CHEMBL348681 | [1-(3-Hydroxy-benzyl)-5-methoxy-2-m...)
Affinity DataIC50:  3.00E+3nM. Assay description: Inhibition of Human Nonpancreatic Secretory Phospholipase A2 through Chromogenic assay
In DepthDetails ArticlePubMed