BDBM50055854 CHEMBL3325795
SMILES CCCC(=O)c1cnn(c1C)-c1ccc(NC(=O)c2cn(CC(=O)N3CCN(C)CC3)c3cc(Br)c(C)cc23)cc1
InChI Key InChIKey=DRMWSFRPKMHIEH-UHFFFAOYSA-N
Data  2 IC50
  Tab Delimited (TSV)   2D SDfile   Computed 3D by Vconf -m prep SDfile
Find this compound or compounds like it in BindingDB:
Activity Spreadsheet -- Enzyme Inhibition Constant Data from BindingDB
Found 2 hits for monomerid = 50055854
TargetP2Y purinoceptor 12(Rattus norvegicus)
Sanofi R & D
Curated by ChEMBL
LigandPNGBDBM50055854(CHEMBL3325795)
Affinity DataIC50:  1.70E+3nM. Assay description: Antagonist activity at P2Y12 receptor in Sprague-Dawley rat platelet rich plasma assessed as inhibition of ADP-induced aggregation
In DepthDetails ArticlePubMed
TargetP2Y purinoceptor 12(Homo sapiens (Human))
Sanofi R & D
Curated by ChEMBL
LigandPNGBDBM50055854(CHEMBL3325795)
Affinity DataIC50:  118nM. Assay description: Antagonist activity at P2Y12 receptor in Sprague-Dawley rat platelet rich plasma assessed as inhibition of ADP-induced aggregation
In DepthDetails ArticlePubMed