BDBM50056062 (2R,3R,4S)-4-(2,3-Dihydro-benzofuran-5-yl)-2-(4-methoxy-phenyl)-1-[(methyl-propyl-carbamoyl)-methyl]-pyrrolidine-3-carboxylic acid::CHEMBL109736
SMILES CCCN(C)C(=O)CN1C[C@@H]([C@H]([C@@H]1c1ccc(OC)cc1)C(O)=O)c1ccc2OCCc2c1
InChI Key InChIKey=ADJHJKMXYNCUIT-SDUSCBPUSA-N
Data  2 IC50
  Tab Delimited (TSV)   2D SDfile   Computed 3D by Vconf -m prep SDfile
Find this compound or compounds like it in BindingDB:
Activity Spreadsheet -- Enzyme Inhibition Constant Data from BindingDB
Found 2 hits for monomerid = 50056062
TargetEndothelin-1 receptor(RAT)
Abbott Laboratories
Curated by ChEMBL
LigandPNGBDBM50056062((2R,3R,4S)-4-(2,3-Dihydro-benzofuran-5-yl)-2-(4-me...)
Affinity DataIC50:  130nM. Assay description: Binding affinity towards endothelin A receptor in prolactin secreting rat pituitary cells using [125I]-ET-1 as radioligand.
In DepthDetails ArticlePubMed
TargetEndothelin receptor type B(Sus scrofa)
Abbott Laboratories
Curated by ChEMBL
LigandPNGBDBM50056062((2R,3R,4S)-4-(2,3-Dihydro-benzofuran-5-yl)-2-(4-me...)
Affinity DataIC50:  1.90E+4nM. Assay description: Binding affinity towards endothelin B receptor in porcine cerebellar tissue using [125I]-ET-1 as radioligand.
In DepthDetails ArticlePubMed