BDBM50056323 CHEMBL3322459
SMILES Cc1c(nn(c1-c1ccc(Cl)cc1)-c1ccc(Cl)cc1Cl)C(=O)NCCCCNC(=O)[C@H]1CC[C@H](CC1)C(=O)NCCCCNC(=O)c1nn(c(c1C)-c1ccc(Cl)cc1)-c1ccc(Cl)cc1Cl
InChI Key InChIKey=DIFADDLOGWFLQI-AQOUDTPCSA-N
Data  2 EC50
  Tab Delimited (TSV)   2D SDfile   Computed 3D by Vconf -m prep SDfile
Find this compound or compounds like it in BindingDB:
Activity Spreadsheet -- Enzyme Inhibition Constant Data from BindingDB
Found 2 hits for monomerid = 50056323
TargetCannabinoid receptor 1(Homo sapiens (Human))
Julius-Maximilians-Universit£T W£Rzburg
Curated by ChEMBL
LigandPNGBDBM50056323(CHEMBL3322459)
Affinity DataEC50:  9.66E+3nM. Assay description: Inverse agonist activity at human CB1 receptor expressed in Sf9 cells coexpressing Gbeta1gamma2 and RSG4 assessed as degradation of [gamma-33P]GTP af...
In DepthDetails ArticlePubMed
TargetCannabinoid receptor 1(Homo sapiens (Human))
Julius-Maximilians-Universit£T W£Rzburg
Curated by ChEMBL
LigandPNGBDBM50056323(CHEMBL3322459)
Affinity DataEC50:  9.55E+3nM. Assay description: Inverse agonist activity at human CB1 receptor expressed in Sf9 cells coexpressing Gbeta1gamma2 and RSG4 assessed as degradation of [gamma-33P]GTP af...
In DepthDetails ArticlePubMed