BDBM50056352 CHEMBL3326570
SMILES CC1(C)C[C@@H](NC(=O)Nc2cccc3cnccc23)c2ccc(F)cc2O1
InChI Key InChIKey=UGNRNJDBLIKGQC-GOSISDBHSA-N
Data  3 IC50
  Tab Delimited (TSV)   2D SDfile   Computed 3D by Vconf -m prep SDfile
Find this compound or compounds like it in BindingDB:
Activity Spreadsheet -- Enzyme Inhibition Constant Data from BindingDB
Found 3 hits for monomerid = 50056352
TargetCytochrome P450 3A4(Homo sapiens (Human))
Abbvie
Curated by ChEMBL
LigandPNGBDBM50056352(CHEMBL3326570)
Affinity DataIC50:  660nM. Assay description: Inhibition of CYP3A4 in human liver microsomes using 7-benzyloxyquiniline substrate and NADPH incubated up to 2 hrs
In DepthDetails ArticlePubMed
LigandPNGBDBM50056352(CHEMBL3326570)
Affinity DataIC50:  4nM. Assay description: Antagonist activity against human TRPV1 expressed in HEK293 cells assessed as capsaicin-induced calcium flux by FLIPR assay
In DepthDetails ArticlePubMed
TargetCytochrome P450 2D6(Homo sapiens (Human))
Abbvie
Curated by ChEMBL
LigandPNGBDBM50056352(CHEMBL3326570)
Affinity DataIC50: <80nM. Assay description: Inhibition of CYP2D6 in human liver microsomes using AMMC substrate and NADPH incubated up to 2 hrs
In DepthDetails ArticlePubMed