BDBM50056390 CHEMBL3326585
SMILES Cc1cc2c(NC(=O)N[C@@H]3CC(C)(C)Oc4cc(OC(F)(F)F)ccc34)cccc2cn1
InChI Key InChIKey=YJLGMMODESAVMW-LJQANCHMSA-N
Data  3 IC50
  Tab Delimited (TSV)   2D SDfile   Computed 3D by Vconf -m prep SDfile
Find this compound or compounds like it in BindingDB:
Activity Spreadsheet -- Enzyme Inhibition Constant Data from BindingDB
Found 3 hits for monomerid = 50056390
TargetCytochrome P450 3A4(Homo sapiens (Human))
Abbvie
Curated by ChEMBL
LigandPNGBDBM50056390(CHEMBL3326585)
Affinity DataIC50: >2.00E+4nM. Assay description: Inhibition of CYP3A4 in human liver microsomes using 7-benzyloxyquiniline substrate and NADPH incubated up to 2 hrs
In DepthDetails ArticlePubMed
LigandPNGBDBM50056390(CHEMBL3326585)
Affinity DataIC50:  32nM. Assay description: Antagonist activity against human TRPV1 expressed in HEK293 cells assessed as capsaicin-induced calcium flux by FLIPR assay
In DepthDetails ArticlePubMed
TargetCytochrome P450 2D6(Homo sapiens (Human))
Abbvie
Curated by ChEMBL
LigandPNGBDBM50056390(CHEMBL3326585)
Affinity DataIC50:  6.00E+3nM. Assay description: Inhibition of CYP2D6 in human liver microsomes using AMMC substrate and NADPH incubated up to 2 hrs
In DepthDetails ArticlePubMed