BDBM50056679 CHEMBL3341793
SMILES Nc1ncc(cc1-c1cccc2ncccc12)-c1ccc(cc1)N1CCNCC1
InChI Key InChIKey=DXOUGEWPGDMNOM-UHFFFAOYSA-N
Data  4 IC50
  Tab Delimited (TSV)   2D SDfile   Computed 3D by Vconf -m prep SDfile
Find this compound or compounds like it in BindingDB:
Activity Spreadsheet -- Enzyme Inhibition Constant Data from BindingDB
Found 4 hits for monomerid = 50056679
TargetActivin receptor type-1(Homo sapiens (Human))
Massachusetts Institute Of Technology
Curated by ChEMBL
LigandPNGBDBM50056679(CHEMBL3341793)
Affinity DataIC50:  270nM. Assay description: Inhibition of human recombinant human ALK2 kinase after 45 mins by liquid scintillation counting in presence of ATP [gamma-32P]
In DepthDetails ArticlePubMed
TargetTGF-beta receptor type-1(Homo sapiens (Human))
Massachusetts Institute Of Technology
Curated by ChEMBL
LigandPNGBDBM50056679(CHEMBL3341793)
Affinity DataIC50:  9.90E+4nM. Assay description: Inhibition of purified human ALK5 kinase after 45 mins by liquid scintillation counting in presence of ATP [gamma-32P]
In DepthDetails ArticlePubMed
TargetTGF-beta receptor type-1(Homo sapiens (Human))
Massachusetts Institute Of Technology
Curated by ChEMBL
LigandPNGBDBM50056679(CHEMBL3341793)
Affinity DataIC50:  3.48E+4nM. Assay description: Inhibition of TGFbeta1-induced TGFbeta type 1 ALK5 in HEK293T cells after 30 mins by luciferase reporter gene assay
In DepthDetails ArticlePubMed
TargetActivin receptor type-1(Mus musculus)
Massachusetts Institute Of Technology
Curated by ChEMBL
LigandPNGBDBM50056679(CHEMBL3341793)
Affinity DataIC50:  470nM. Assay description: Inhibition of BMP6-induced BMP receptor type 1 ALK2 in mouse C2C12 cells after 30 mins by luciferase reporter gene assay
In DepthDetails ArticlePubMed