BDBM50056688 CHEMBL3341955
SMILES COc1cc(cc(OC)c1OC)-c1cc(cnc1N(C)C)-c1ccc(cc1)N1CCNCC1
InChI Key InChIKey=LUZIYUUIPOUVLK-UHFFFAOYSA-N
Data  2 IC50
  Tab Delimited (TSV)   2D SDfile   Computed 3D by Vconf -m prep SDfile
Find this compound or compounds like it in BindingDB:
Activity Spreadsheet -- Enzyme Inhibition Constant Data from BindingDB
Found 2 hits for monomerid = 50056688
TargetActivin receptor type-1(Mus musculus)
Massachusetts Institute Of Technology
Curated by ChEMBL
LigandPNGBDBM50056688(CHEMBL3341955)
Affinity DataIC50:  1.70E+3nM. Assay description: Inhibition of BMP6-induced BMP receptor type 1 ALK2 in mouse C2C12 cells after 30 mins by luciferase reporter gene assay
In DepthDetails ArticlePubMed
TargetTGF-beta receptor type-1(Homo sapiens (Human))
Massachusetts Institute Of Technology
Curated by ChEMBL
LigandPNGBDBM50056688(CHEMBL3341955)
Affinity DataIC50:  1.15E+5nM. Assay description: Inhibition of TGFbeta1-induced TGFbeta type 1 ALK5 in HEK293T cells after 30 mins by luciferase reporter gene assay
In DepthDetails ArticlePubMed