BDBM50056773 (S)-1-(2-Amino-3,3-diphenyl-propionyl)-pyrrolidine-2-carboxylic acid (4-amino-cyclohexylmethyl)-amide::CHEMBL168741
SMILES NC(C(c1ccccc1)c1ccccc1)C(=O)N1CCC[C@H]1C(=O)NCC1CCC(N)CC1
InChI Key InChIKey=SEBIKUOIXHBWMY-KQVFYFFLSA-N
Data  1 KI
  Tab Delimited (TSV)   2D SDfile   Computed 3D by Vconf -m prep SDfile
Find this compound or compounds like it in BindingDB:
Activity Spreadsheet -- Enzyme Inhibition Constant Data from BindingDB
Found 1 hit for monomerid = 50056773
TargetProthrombin(Homo sapiens (Human))
Merck Research Laboratories
Curated by ChEMBL
LigandPNGBDBM50056773((S)-1-(2-Amino-3,3-diphenyl-propionyl)-pyrrolidine...)
Affinity DataKi:  0.100nM. Assay description: Binding affinity towards thrombin
In DepthDetails ArticlePubMed