BDBM50057001 CHEMBL361563::N-[6-(2,3-Difluoro-phenylsulfanyl)-1-oxo-indan-5-yl]-methanesulfonamide
SMILES CS(=O)(=O)Nc1cc2CCC(=O)c2cc1Sc1cccc(F)c1F
InChI Key InChIKey=FBWPNNUXDCEDTG-UHFFFAOYSA-N
Data  2 IC50
  Tab Delimited (TSV)   2D SDfile   Computed 3D by Vconf -m prep SDfile
Find this compound or compounds like it in BindingDB:
Activity Spreadsheet -- Enzyme Inhibition Constant Data from BindingDB
Found 2 hits for monomerid = 50057001
TargetProstaglandin G/H synthase 2(Homo sapiens (Human))
Boehringer Ingelheim Pharmaceuticals
Curated by ChEMBL
LigandPNGBDBM50057001(CHEMBL361563 | N-[6-(2,3-Difluoro-phenylsulfanyl)-...)
Affinity DataIC50:  50nM. Assay description: Inhibition of human Prostaglandin G/H synthase 2 at 10 ug/mL expressed as the mean percent inhibition of control PGE-2 production
In DepthDetails ArticlePubMed
TargetProstaglandin G/H synthase 1(Homo sapiens (Human))
Boehringer Ingelheim Pharmaceuticals
Curated by ChEMBL
LigandPNGBDBM50057001(CHEMBL361563 | N-[6-(2,3-Difluoro-phenylsulfanyl)-...)
Affinity DataIC50: >1.00E+4nM. Assay description: Inhibition of human Prostaglandin G/H synthase 1 at 10 ug/mL expressed as the mean percent inhibition of control PGE-2 production
In DepthDetails ArticlePubMed