BDBM50057067 (2S,4R)-2-Butyl-4-((S)-2,2-dimethyl-1-methylcarbamoyl-propylcarbamoyl)-6-(4'-formyl-biphenyl-4-yl)-hexanoic acid::CHEMBL269334
SMILES CCCC[C@@H](C[C@@H](CCc1ccc(cc1)-c1ccc(C=O)cc1)C(=O)N[C@H](C(=O)NC)C(C)(C)C)C(O)=O
InChI Key InChIKey=ZVCHAVSCMLWXRD-KWXIBIRDSA-N
Data  2 KI
  Tab Delimited (TSV)   2D SDfile   Computed 3D by Vconf -m prep SDfile
Find this compound or compounds like it in BindingDB:
Activity Spreadsheet -- Enzyme Inhibition Constant Data from BindingDB
Found 2 hits for monomerid = 50057067
TargetStromelysin-1(Homo sapiens (Human))
Merck Research Laboratories
Curated by ChEMBL
LigandPNGBDBM50057067((2S,4R)-2-Butyl-4-((S)-2,2-dimethyl-1-methylcarbam...)
Affinity DataKi:  15nM. Assay description: Inhibition of human stromelysin-1 (Matrix metalloproteinase-3)
In DepthDetails ArticlePubMed
Target72 kDa type IV collagenase(Homo sapiens (Human))
Merck Research Laboratories
Curated by ChEMBL
LigandPNGBDBM50057067((2S,4R)-2-Butyl-4-((S)-2,2-dimethyl-1-methylcarbam...)
Affinity DataKi:  16nM. Assay description: Inhibition of gelatinase A (Matrix metalloproteinase-2)
In DepthDetails ArticlePubMed