BDBM50057073 (2S,4R)-6-(4'-Fluoro-biphenyl-4-yl)-4-((S)-3-methyl-1-phenylcarbamoyl-butylcarbamoyl)-2-[4-(1-oxo-1,3-dihydro-isoindol-2-yl)-butyl]-hexanoic acid::6-(4'-FLUORO-BIPHENYL-4-YL)-4-(3-METHYL-1-PHENYLCARBAMOYL-BUTYLCARBAMOYL)-2-[4-(1-OXO-1,3-DIHYDRO-ISOINDOL-2-YL)-BUTYL]-HEXANOIC ACID::CHEMBL8933::L-764004
SMILES CC(C)C[C@H](NC(=O)[C@H](CCc1ccc(cc1)-c1ccc(F)cc1)C[C@H](CCCCN1Cc2ccccc2C1=O)C(O)=O)C(=O)Nc1ccccc1
InChI Key InChIKey=WSHMSPGZDPZGRV-GZYXPWJKSA-N
Data  1 KI
PDB links: 1 PDB ID matches this monomer.
  Tab Delimited (TSV)   2D SDfile   Computed 3D by Vconf -m prep SDfile
Find this compound or compounds like it in BindingDB:
Activity Spreadsheet -- Enzyme Inhibition Constant Data from BindingDB
Found 1 hit for monomerid = 50057073
TargetStromelysin-1(Homo sapiens (Human))
Merck Research Laboratories
Curated by ChEMBL
LigandPNGBDBM50057073((2S,4R)-6-(4'-Fluoro-biphenyl-4-yl)-4-((S)-3-methy...)
Affinity DataKi:  2nM. Assay description: Inhibition of human stromelysin-1 (Matrix metalloproteinase-3)