BDBM50057093 (2-Benzo[1,3]dioxol-5-yl-ethyl)-(5-methoxy-1,2,3,4-tetrahydro-naphthalen-1-ylmethyl)-methyl-amine::CHEMBL9831
SMILES COc1cccc2C(CN(C)CCc3ccc4OCOc4c3)CCCc12
InChI Key InChIKey=MHXINXPTKUQZKP-UHFFFAOYSA-N
Data  1 KI  2 IC50
  Tab Delimited (TSV)   2D SDfile   Computed 3D by Vconf -m prep SDfile
Find this compound or compounds like it in BindingDB:
Activity Spreadsheet -- Enzyme Inhibition Constant Data from BindingDB
Found 3 hits for monomerid = 50057093
Target5-hydroxytryptamine receptor 1A(Homo sapiens (Human))
Organon Laboratories
Curated by ChEMBL
LigandPNGBDBM50057093((2-Benzo[1,3]dioxol-5-yl-ethyl)-(5-methoxy-1,2,3,4...)
Affinity DataKi:  6.70nM. Assay description: Inhibition constant against 5-hydroxytryptamine 1A receptor
In DepthDetails ArticlePubMed
TargetSodium-dependent serotonin transporter(Homo sapiens (Human))
Organon Laboratories
Curated by ChEMBL
LigandPNGBDBM50057093((2-Benzo[1,3]dioxol-5-yl-ethyl)-(5-methoxy-1,2,3,4...)
Affinity DataIC50:  21nM. Assay description: Inhibitory concentration against serotonin transporter
In DepthDetails ArticlePubMed
TargetSodium-dependent serotonin transporter(Rattus norvegicus (rat))
Abbott Laboratories
Curated by ChEMBL
LigandPNGBDBM50057093((2-Benzo[1,3]dioxol-5-yl-ethyl)-(5-methoxy-1,2,3,4...)
Affinity DataIC50:  20.6nM. Assay description: Inhibition of uptake of [3H]-5-HT in synaptosomes from rat cortex
In DepthDetails ArticlePubMed