BDBM50057215 3-Benzo[1,3]dioxol-5-yl-5-hydroxy-5-(4-methoxy-phenyl)-4-naphthalen-1-ylmethyl-5H-furan-2-one::CHEMBL269409
SMILES COc1ccc(cc1)C1(O)OC(=O)C(=C1Cc1cccc2ccccc12)c1ccc2OCOc2c1
InChI Key InChIKey=BEOPICWDIUVLRU-UHFFFAOYSA-N
Data  2 IC50
  Tab Delimited (TSV)   2D SDfile   Computed 3D by Vconf -m prep SDfile
Find this compound or compounds like it in BindingDB:
Activity Spreadsheet -- Enzyme Inhibition Constant Data from BindingDB
Found 2 hits for monomerid = 50057215
TargetEndothelin receptor type B(Homo sapiens (Human))
Warner-Lambert
Curated by ChEMBL
LigandPNGBDBM50057215(3-Benzo[1,3]dioxol-5-yl-5-hydroxy-5-(4-methoxy-phe...)
Affinity DataIC50: >2.50E+3nM. Assay description: Binding affinity against human cloned Endothelin B receptor expressed in CHO-K1 cells
In DepthDetails ArticlePubMed
TargetEndothelin-1 receptor(Homo sapiens (Human))
Warner-Lambert
Curated by ChEMBL
LigandPNGBDBM50057215(3-Benzo[1,3]dioxol-5-yl-5-hydroxy-5-(4-methoxy-phe...)
Affinity DataIC50:  18nM. Assay description: Binding affinity against human cloned endothelin A receptor expressed in LTK-cells
In DepthDetails ArticlePubMed