BDBM50057330 CHEMBL3322654
SMILES CCCCOC(=O)N1CCN(CC1)C(=O)[C@H](CCC(O)=O)NC(=O)c1cc(nc(n1)-c1ccccc1)[C@H]1C[C@H]1COC
InChI Key InChIKey=JYWHVURROUEYNL-VABKMULXSA-N
Data  1 IC50
  Tab Delimited (TSV)   2D SDfile   Computed 3D by Vconf -m prep SDfile
Find this compound or compounds like it in BindingDB:
Activity Spreadsheet -- Enzyme Inhibition Constant Data from BindingDB
Found 1 hit for monomerid = 50057330
TargetP2Y purinoceptor 12(Homo sapiens (Human))
Actelion Pharmaceuticals
Curated by ChEMBL
LigandPNGBDBM50057330(CHEMBL3322654)
Affinity DataIC50:  9nM. Assay description: Displacement of [3H]-2-methyl-thio-adenosine 5'-diphosphate from human recombinant P2Y12 expressed in CHO cell membranes by scintillation counting me...
In DepthDetails ArticlePubMed