BDBM50057429 CHEMBL22328::[2-(7-Fluoro-chroman-8-yloxy)-ethyl]-[4-(4-methoxy-phenyl)-butyl]-amine
SMILES COc1ccc(CCCCNCCOc2c(F)ccc3CCCOc23)cc1
InChI Key InChIKey=TVNIVNPKPOOYNO-UHFFFAOYSA-N
Data  2 KI
  Tab Delimited (TSV)   2D SDfile   Computed 3D by Vconf -m prep SDfile
Find this compound or compounds like it in BindingDB:
Activity Spreadsheet -- Enzyme Inhibition Constant Data from BindingDB
Found 2 hits for monomerid = 50057429
Target5-hydroxytryptamine receptor 1A(Rattus norvegicus (rat))
Yamanouchi Pharmaceutical
Curated by ChEMBL
LigandPNGBDBM50057429(CHEMBL22328 | [2-(7-Fluoro-chroman-8-yloxy)-ethyl]...)
Affinity DataKi:  0.350nM. Assay description: Displacement of [3H]8-OH-DPAT from rat hippocampal 5-hydroxytryptamine 1A receptor
In DepthDetails ArticlePubMed
TargetD(2) dopamine receptor(Rattus norvegicus (rat))
Yamanouchi Pharmaceutical
Curated by ChEMBL
LigandPNGBDBM50057429(CHEMBL22328 | [2-(7-Fluoro-chroman-8-yloxy)-ethyl]...)
Affinity DataKi:  21nM. Assay description: In vitro radioligand binding assay on Dopamine receptor D2 of rat striatum using [3H]- spiperone
In DepthDetails ArticlePubMed