BDBM50057469 (10R,13S,17S)-17-Diisopropylcarbamoyl-4,10,13-trimethyl-2,7,8,9,10,11,12,13,14,15,16,17-dodecahydro-1H-cyclopenta[a]phenanthrene-3-carboxylic acid::17-Diisopropylcarbamoyl-4,10,13-trimethyl-2,7,8,9,10,11,12,13,14,15,16,17-dodecahydro-1H-cyclopenta[a]phenanthrene-3-carboxylic acid::CHEMBL422046
SMILES CC(C)N(C(C)C)C(=O)[C@H]1CCC2C3CC=C4C(C)=C(CC[C@]4(C)C3CC[C@]12C)C(O)=O
InChI Key InChIKey=ABJZRFNMYUZPFJ-HEHXGUDPSA-N
Data  2 KI
  Tab Delimited (TSV)   2D SDfile   Computed 3D by Vconf -m prep SDfile
Find this compound or compounds like it in BindingDB:
Activity Spreadsheet -- Enzyme Inhibition Constant Data from BindingDB
Found 2 hits for monomerid = 50057469
Target3-oxo-5-alpha-steroid 4-dehydrogenase 2(Homo sapiens (Human))
Smith Kline & French Laboratories
Curated by ChEMBL
LigandPNGBDBM50057469((10R,13S,17S)-17-Diisopropylcarbamoyl-4,10,13-trim...)
Affinity DataKi:  35nM. Assay description: In vitro inhibition of Steroid 5-alpha-reductase in human prostatic tissue.
In DepthDetails ArticlePubMed
Target3-oxo-5-alpha-steroid 4-dehydrogenase 1/2(Rattus norvegicus)
Smith Kline & French Laboratories
Curated by ChEMBL
LigandPNGBDBM50057469((10R,13S,17S)-17-Diisopropylcarbamoyl-4,10,13-trim...)
Affinity DataKi:  70nM. Assay description: In vitro inhibition of Steroid 5-alpha-reductase in rat ventral prostates.
In DepthDetails ArticlePubMed