BDBM50057500 (1S,9aR,11aS)-6-Chloro-9a,11a-dimethyl-7-oxo-2,3,3a,3b,4,5,7,8,9,9a,9b,10,11,11a-tetradecahydro-1H-cyclopenta[i]phenanthridine-1-carboxylic acid (2,5-bis-trifluoromethyl-phenyl)-amide::CHEMBL282037
SMILES C[C@]12CCC3C(CN=C4C(Cl)C(=O)CC[C@]34C)C1CC[C@@H]2C(=O)Nc1cc(ccc1C(F)(F)F)C(F)(F)F
InChI Key InChIKey=MYYLULRVFXQYTI-CZNZAHMNSA-N
Data  2 KI
  Tab Delimited (TSV)   2D SDfile   Computed 3D by Vconf -m prep SDfile
Find this compound or compounds like it in BindingDB:
Activity Spreadsheet -- Enzyme Inhibition Constant Data from BindingDB
Found 2 hits for monomerid = 50057500
Target3-oxo-5-alpha-steroid 4-dehydrogenase 1(Homo sapiens (Human))
Pfizer
Curated by ChEMBL
LigandPNGBDBM50057500((1S,9aR,11aS)-6-Chloro-9a,11a-dimethyl-7-oxo-2,3,3...)
Affinity DataKi:  0.200nM. Assay description: Binding affinity for human 5 alpha reductase 1 isozyme
In DepthDetails ArticlePubMed
LigandPNGBDBM50057500((1S,9aR,11aS)-6-Chloro-9a,11a-dimethyl-7-oxo-2,3,3...)
Affinity DataKi:  190nM. Assay description: Binding affinity for 3-beta-hydroxysteroid dehydrogenase
In DepthDetails ArticlePubMed