BDBM50057607 4-[5-(3,4-Dimethoxy-phenyl)-3-trifluoromethyl-pyrazol-1-yl]-benzenesulfonamide::CHEMBL282360
SMILES COc1ccc(cc1OC)-c1cc(nn1-c1ccc(cc1)S(N)(=O)=O)C(F)(F)F
InChI Key InChIKey=VNNGIYNQDQOQCJ-UHFFFAOYSA-N
Data  6 IC50
  Tab Delimited (TSV)   2D SDfile   Computed 3D by Vconf -m prep SDfile
Find this compound or compounds like it in BindingDB:
Activity Spreadsheet -- Enzyme Inhibition Constant Data from BindingDB
Found 6 hits for monomerid = 50057607
TargetProstaglandin G/H synthase 1(Homo sapiens (Human))
Searle Research And Development
Curated by ChEMBL
LigandPNGBDBM50057607(4-[5-(3,4-Dimethoxy-phenyl)-3-trifluoromethyl-pyra...)
Affinity DataIC50: >1.00E+5nM. Assay description: In vitro inhibitory concentration required to block recombinant human prostaglandin G/H synthase 1 (COX-1)
In DepthDetails ArticlePubMed
TargetProstaglandin G/H synthase 2(Homo sapiens (Human))
Searle Research And Development
Curated by ChEMBL
LigandPNGBDBM50057607(4-[5-(3,4-Dimethoxy-phenyl)-3-trifluoromethyl-pyra...)
Affinity DataIC50:  600nM. Assay description: In vitro inhibitory concentration required to block human recombinant prostaglandin G/H synthase 2 (COX-2)
In DepthDetails ArticlePubMed
TargetProstaglandin G/H synthase 1(Ovis aries (Sheep))
Chinese Academy Of Sciences
Curated by ChEMBL
LigandPNGBDBM50057607(4-[5-(3,4-Dimethoxy-phenyl)-3-trifluoromethyl-pyra...)
Affinity DataIC50: >1.00E+5nM. Assay description: Inhibitory activity against prostaglandin G/H synthase 1 (COX-1)
In DepthDetails ArticlePubMed
TargetProstaglandin G/H synthase 2(Homo sapiens (Human))
Searle Research And Development
Curated by ChEMBL
LigandPNGBDBM50057607(4-[5-(3,4-Dimethoxy-phenyl)-3-trifluoromethyl-pyra...)
Affinity DataIC50:  603nM. Assay description: Inhibition of human Prostaglandin G/H synthase 2
In DepthDetails ArticlePubMed
TargetProstaglandin G/H synthase 2(Mus musculus (Mouse))
Chinese Academy Of Sciences
Curated by ChEMBL
LigandPNGBDBM50057607(4-[5-(3,4-Dimethoxy-phenyl)-3-trifluoromethyl-pyra...)
Affinity DataIC50:  603nM. Assay description: Inhibitory activity against prostaglandin G/H synthase 2 (COX-2)
In DepthDetails ArticlePubMed
TargetProstaglandin G/H synthase 2(Homo sapiens (Human))
Searle Research And Development
Curated by ChEMBL
LigandPNGBDBM50057607(4-[5-(3,4-Dimethoxy-phenyl)-3-trifluoromethyl-pyra...)
Affinity DataIC50:  600nM. Assay description: Inhibitory concentration against human prostaglandin G/H synthase 2 at 25 degrees.
In DepthDetails ArticlePubMed