BDBM50057719 3,4,5-Trihydroxy-6-hydroxymethyl-tetrahydro-pyran-2-carboxylic acid hydrazide::CHEMBL334655
SMILES [H][C@]1(O[C@H](CO)[C@@H](O)[C@H](O)[C@H]1O)C(=O)NN
InChI Key InChIKey=KXYIPPQUVZPZCQ-VFUOTHLCSA-N
Data  5 KI
  Tab Delimited (TSV)   2D SDfile   Computed 3D by Vconf -m prep SDfile
Find this compound or compounds like it in BindingDB:
Activity Spreadsheet -- Enzyme Inhibition Constant Data from BindingDB
Found 5 hits for monomerid = 50057719
TargetGlycogen phosphorylase, brain form(Homo sapiens (Human))
Philipps-Universit£T Marburg
Curated by ChEMBL
LigandPNGBDBM50057719(3,4,5-Trihydroxy-6-hydroxymethyl-tetrahydro-pyran-...)
Affinity DataKi:  3.98E+5nM. Assay description: Inhibitory activity against Pig Skeletal Glycogen Phosphorylase b
In DepthDetails ArticlePubMed
TargetGlycogen phosphorylase, brain form(Homo sapiens (Human))
Philipps-Universit£T Marburg
Curated by ChEMBL
LigandPNGBDBM50057719(3,4,5-Trihydroxy-6-hydroxymethyl-tetrahydro-pyran-...)
Affinity DataKi:  4.00E+5nM. Assay description: Inhibition of rabbit glycogen phosphorylase B enzyme
In DepthDetails ArticlePubMed
TargetGlycogen phosphorylase, brain form(Homo sapiens (Human))
Philipps-Universit£T Marburg
Curated by ChEMBL
LigandPNGBDBM50057719(3,4,5-Trihydroxy-6-hydroxymethyl-tetrahydro-pyran-...)
Affinity DataKi:  4.00E+5nM. Assay description: Inhibition of rabbit glycogen phosphorylase B enzyme
In DepthDetails ArticlePubMed
TargetGlycogen phosphorylase, muscle form(Homo sapiens (Human))
University Of Alcala
Curated by ChEMBL
LigandPNGBDBM50057719(3,4,5-Trihydroxy-6-hydroxymethyl-tetrahydro-pyran-...)
Affinity DataKi:  2.52E+6nM. Assay description: Inhibitory activity against rabbit muscle glycogen phosphorylaseChecked by Author
In DepthDetails ArticlePubMed
TargetGlycogen phosphorylase, muscle form(Homo sapiens (Human))
University Of Alcala
Curated by ChEMBL
LigandPNGBDBM50057719(3,4,5-Trihydroxy-6-hydroxymethyl-tetrahydro-pyran-...)
Affinity DataKi:  2.52E+6nM. Assay description: Inhibitory activity against rabbit muscle glycogen phosphorylaseChecked by Author
In DepthDetails ArticlePubMed