BDBM50057752 CHEMBL423484::Methanesulfonic acid 3,4,5-trihydroxy-6-hydroxymethyl-tetrahydro-pyran-2-ylmethyl ester
SMILES CS(=O)(=O)OCC1OC(CO)C(O)C(O)C1O
InChI Key InChIKey=QQELGSQNRQUROT-UHFFFAOYSA-N
Data  2 KI
  Tab Delimited (TSV)   2D SDfile   Computed 3D by Vconf -m prep SDfile
Find this compound or compounds like it in BindingDB:
Activity Spreadsheet -- Enzyme Inhibition Constant Data from BindingDB
Found 2 hits for monomerid = 50057752
TargetGlycogen phosphorylase, muscle form(Homo sapiens (Human))
University Of Alcala
Curated by ChEMBL
LigandPNGBDBM50057752(CHEMBL423484 | Methanesulfonic acid 3,4,5-trihydro...)
Affinity DataKi:  2.32E+6nM. Assay description: Inhibitory activity against rabbit muscle glycogen phosphorylaseChecked by Author
In DepthDetails ArticlePubMed
TargetGlycogen phosphorylase, brain form(Homo sapiens (Human))
University Of Perugia
Curated by ChEMBL
LigandPNGBDBM50057752(CHEMBL423484 | Methanesulfonic acid 3,4,5-trihydro...)
Affinity DataKi:  4.80E+6nM. Assay description: Inhibition of rabbit glycogen phosphorylase B enzyme
In DepthDetails ArticlePubMed