BDBM50057836 CHEMBL3326179
SMILES Cc1ccccc1-c1ccoc1C(=O)NNC(=O)c1ccc(O)c(c1)[N+]([O-])=O
InChI Key InChIKey=KFIDPWUGCZSNQL-UHFFFAOYSA-N
Data  1 IC50
  Tab Delimited (TSV)   2D SDfile   Computed 3D by Vconf -m prep SDfile
Find this compound or compounds like it in BindingDB:
Activity Spreadsheet -- Enzyme Inhibition Constant Data from BindingDB
Found 1 hit for monomerid = 50057836
TargetGlucagon receptor(Rattus norvegicus)
Dainippon Sumitomo Pharma
Curated by ChEMBL
LigandPNGBDBM50057836(CHEMBL3326179)
Affinity DataIC50:  1.80E+5nM. Assay description: Displacement of [125I]glucagon from glucagon receptor in rat hepatocyte membranes after 30 mins by gamma-counting
In DepthDetails ArticlePubMed