BDBM50057884 1-(4-Fluoro-phenyl)-5-(4-methanesulfonyl-phenyl)-2-methyl-3-(2,2,2-trifluoro-ethyl)-1H-pyrrole::CHEMBL44038
SMILES Cc1c(CC(F)(F)F)cc(-c2ccc(cc2)S(C)(=O)=O)n1-c1ccc(F)cc1
InChI Key InChIKey=KKKZOKQDFWCLMP-UHFFFAOYSA-N
Data  3 IC50
  Tab Delimited (TSV)   2D SDfile   Computed 3D by Vconf -m prep SDfile
Find this compound or compounds like it in BindingDB:
Activity Spreadsheet -- Enzyme Inhibition Constant Data from BindingDB
Found 3 hits for monomerid = 50057884
TargetProstaglandin G/H synthase 1(Homo sapiens (Human))
Searle Research And Development
Curated by ChEMBL
LigandPNGBDBM50057884(1-(4-Fluoro-phenyl)-5-(4-methanesulfonyl-phenyl)-2...)
Affinity DataIC50: >1.00E+5nM. Assay description: In vitro inhibitory activity against human prostaglandin G/H synthase 1
In DepthDetails ArticlePubMed
TargetProstaglandin G/H synthase 2(Homo sapiens (Human))
Universit£
Curated by ChEMBL
LigandPNGBDBM50057884(1-(4-Fluoro-phenyl)-5-(4-methanesulfonyl-phenyl)-2...)
Affinity DataIC50:  141nM. Assay description: Inhibition of human Prostaglandin G/H synthase 2
In DepthDetails ArticlePubMed
TargetProstaglandin G/H synthase 2(Homo sapiens (Human))
Universit£
Curated by ChEMBL
LigandPNGBDBM50057884(1-(4-Fluoro-phenyl)-5-(4-methanesulfonyl-phenyl)-2...)
Affinity DataIC50:  140nM. Assay description: In vitro inhibitory activity against human prostaglandin G/H synthase 2
In DepthDetails ArticlePubMed