BDBM50058007 1-Cyclopropylmethyl-4-(4-iodo-phenoxymethyl)-piperidine::CHEMBL44739
SMILES Ic1ccc(OCC2CCN(CC3CC3)CC2)cc1
InChI Key InChIKey=JXQVMKWSWFFOHD-UHFFFAOYSA-N
Data  2 KI
  Tab Delimited (TSV)   2D SDfile   Computed 3D by Vconf -m prep SDfile
Find this compound or compounds like it in BindingDB:
Activity Spreadsheet -- Enzyme Inhibition Constant Data from BindingDB
Found 2 hits for monomerid = 50058007
LigandPNGBDBM50058007(1-Cyclopropylmethyl-4-(4-iodo-phenoxymethyl)-piper...)
Affinity DataKi:  0.5nM. Assay description: In vitro for binding affinity at sigma-1 receptor by measuring its ability to displace [3H]-(+)-pentazocine from guinea pig membranes
In DepthDetails ArticlePubMed
TargetD(2) dopamine receptor(Homo sapiens (Human))
Ansto
Curated by ChEMBL
LigandPNGBDBM50058007(1-Cyclopropylmethyl-4-(4-iodo-phenoxymethyl)-piper...)
Affinity DataKi: >1.00E+4nM. Assay description: In vitro binding affinity for Dopamine receptor D2
In DepthDetails ArticlePubMed