BDBM50058162 CHEMBL3326986
SMILES COc1cccc(c1)-c1ccccc1CNC(=O)CCCCN1CCN(CC1)c1ccccc1OC
InChI Key InChIKey=HQAIPJXVFLLICJ-UHFFFAOYSA-N
Data  1 KI
  Tab Delimited (TSV)   2D SDfile   Computed 3D by Vconf -m prep SDfile
Find this compound or compounds like it in BindingDB:
Activity Spreadsheet -- Enzyme Inhibition Constant Data from BindingDB
Found 1 hit for monomerid = 50058162
Target5-hydroxytryptamine receptor 7(Homo sapiens (Human))
Yonsei University
Curated by ChEMBL
LigandPNGBDBM50058162(CHEMBL3326986)
Affinity DataKi:  22nM. Assay description: Displacement of [3H]LSD from 5-HT7R (unknown origin) expressed in CHO-K1 cells by liquid scintillation counting method
In DepthDetails ArticlePubMed