BDBM50058361 1H-Imidazole-4-carboxylic acid {(S)-2-methyl-1-[2-(3,3,3-trifluoro-1-isopropyl-2-oxo-propylcarbamoyl)-pyrrolidine-1-carbonyl]-propyl}-amide::CHEMBL2372978
SMILES CC(C)[C@H](NC(=O)c1c[nH]cn1)C(=O)N1CCC[C@H]1C(=O)N[C@@H](C(C)C)C(=O)C(F)(F)F
InChI Key InChIKey=MCPMMRQMCVBHTC-KKUMJFAQSA-N
Data  1 KI
  Tab Delimited (TSV)   2D SDfile   Computed 3D by Vconf -m prep SDfile
Find this compound or compounds like it in BindingDB:
Activity Spreadsheet -- Enzyme Inhibition Constant Data from BindingDB
Found 1 hit for monomerid = 50058361
TargetNeutrophil elastase(Homo sapiens (Human))
Zeneca Pharmaceuticals
Curated by ChEMBL
LigandPNGBDBM50058361(1H-Imidazole-4-carboxylic acid {(S)-2-methyl-1-[2-...)
Affinity DataKi:  63nM. Assay description: Inhibitory activity against Human Neutrophil Elastase using acute lung injury model (ALIM) assay
In DepthDetails ArticlePubMed