BDBM50058618 CHEMBL294818::N-hydroxy-N-[1-(5-methyl-2-furyl)ethyl]urea
SMILES CC(N(O)C(N)=O)c1ccc(C)o1
InChI Key InChIKey=NPEPKUYRLBWTCB-UHFFFAOYSA-N
Data  2 IC50
  Tab Delimited (TSV)   2D SDfile   Computed 3D by Vconf -m prep SDfile
Find this compound or compounds like it in BindingDB:
Activity Spreadsheet -- Enzyme Inhibition Constant Data from BindingDB
Found 2 hits for monomerid = 50058618
TargetPolyunsaturated fatty acid 5-lipoxygenase(Rattus norvegicus)
Abbott Laboratories
Curated by ChEMBL
LigandPNGBDBM50058618(CHEMBL294818 | N-hydroxy-N-[1-(5-methyl-2-furyl)et...)
Affinity DataIC50:  1.20E+4nM. Assay description: Inhibition of 5-lipoxygenase on rat basophil leukemia cell line lysate (RBL-1 2H3 subline) by measuring 5-HETE production
In DepthDetails ArticlePubMed
TargetPolyunsaturated fatty acid 5-lipoxygenase(Homo sapiens (Human))
Abbott Laboratories
Curated by ChEMBL
LigandPNGBDBM50058618(CHEMBL294818 | N-hydroxy-N-[1-(5-methyl-2-furyl)et...)
Affinity DataIC50:  940nM. Assay description: Inhibition of 5-lipoxygenase (5-LO) measured as LTB4 production in human whole blood stimulated with calcium ionophore (A23187).
In DepthDetails ArticlePubMed