BDBM50058927 CHEMBL63478::[7-(4-Guanidino-butoxy)-1-oxo-3,4-dihydro-1H-isoquinolin-2-yl]-acetic acid
SMILES NC(=N)NCCCCOc1ccc2CCN(CC(O)=O)C(=O)c2c1
InChI Key InChIKey=RHFVBCQBLUXGMQ-UHFFFAOYSA-N
Data  1 IC50
  Tab Delimited (TSV)   2D SDfile   Computed 3D by Vconf -m prep SDfile
Find this compound or compounds like it in BindingDB:
Activity Spreadsheet -- Enzyme Inhibition Constant Data from BindingDB
Found 1 hit for monomerid = 50058927
TargetIntegrin alpha-IIb/beta-3(Homo sapiens (Human))
Eli Lilly
Curated by ChEMBL
LigandPNGBDBM50058927(CHEMBL63478 | [7-(4-Guanidino-butoxy)-1-oxo-3,4-di...)
Affinity DataIC50:  4.60E+4nM. Assay description: Concentration required to reduce binding of fibrinogen to purified Fibrinogen Receptor by 50% using ELISA
In DepthDetails ArticlePubMed