BDBM50058984 3-(3,4-Dichloro-benzenesulfonyl)-1-(3,4-dimethyl-phenyl)-imidazolidine-2,4-dione::CHEMBL442366
SMILES Cc1ccc(cc1C)N1CC(=O)N(C1=O)S(=O)(=O)c1ccc(Cl)c(Cl)c1
InChI Key InChIKey=WRXQRIDLDWGZSK-UHFFFAOYSA-N
Data  3 IC50
  Tab Delimited (TSV)   2D SDfile   Computed 3D by Vconf -m prep SDfile
Find this compound or compounds like it in BindingDB:
Activity Spreadsheet -- Enzyme Inhibition Constant Data from BindingDB
Found 3 hits for monomerid = 50058984
TargetChymase(Homo sapiens (Human))
Suntory
Curated by ChEMBL
LigandPNGBDBM50058984(3-(3,4-Dichloro-benzenesulfonyl)-1-(3,4-dimethyl-p...)
Affinity DataIC50:  20nM. Assay description: Inhibitory activity against human heart chymase in vitro.
In DepthDetails ArticlePubMed
TargetCathepsin G(Homo sapiens (Human))
Suntory
Curated by ChEMBL
LigandPNGBDBM50058984(3-(3,4-Dichloro-benzenesulfonyl)-1-(3,4-dimethyl-p...)
Affinity DataIC50:  2.00E+4nM. Assay description: Inhibitory activity against human neutrophil cathepsin G.
In DepthDetails ArticlePubMed
TargetChymotrypsinogen A(Bos taurus (bovine))
Suntory
Curated by ChEMBL
LigandPNGBDBM50058984(3-(3,4-Dichloro-benzenesulfonyl)-1-(3,4-dimethyl-p...)
Affinity DataIC50:  6.30E+4nM. Assay description: Inhibitory activity against bovine pancreas alpha-chymotrypsin in vitro
In DepthDetails ArticlePubMed