BDBM50059259 CHEMBL3393341::US9156845, 16
SMILES C[C@H]1CCCN(C1)c1ncnc2[nH]cc(-c3cccc(c3)C#N)c12
InChI Key InChIKey=WVOMGQLDVCJODR-ZDUSSCGKSA-N
Data  8 IC50
  Tab Delimited (TSV)   2D SDfile   Computed 3D by Vconf -m prep SDfile
Find this compound or compounds like it in BindingDB:
Activity Spreadsheet -- Enzyme Inhibition Constant Data from BindingDB
Found 8 hits for monomerid = 50059259
TargetLeucine-rich repeat serine/threonine-protein kinase 2(Homo sapiens (Human))
Pfizer
US Patent
LigandPNGBDBM50059259(CHEMBL3393341 | US9156845, 16)
Affinity DataIC50:  16nMpH: 7.5Assay Description:LRRK2 kinase activity was measured using Lantha Screen technology from Invitrogen. GST-tagged truncated LRRK2 from Invitrogen (Cat # PV4874) was incu...
In DepthDetails US Patent
TargetLeucine-rich repeat serine/threonine-protein kinase 2 [G2019S](Homo sapiens (Human))
Pfizer
US Patent
LigandPNGBDBM50059259(CHEMBL3393341 | US9156845, 16)
Affinity DataIC50:  45nMpH: 7.5Assay Description:LRRK2 kinase activity was measured using Lantha Screen technology from Invitrogen. GST-tagged truncated LRRK2 from Invitrogen (Cat # PV4874) was incu...
In DepthDetails US Patent
TargetTyrosine-protein kinase JAK1(Homo sapiens (Human))
Pfizer
Curated by ChEMBL
LigandPNGBDBM50059259(CHEMBL3393341 | US9156845, 16)
Affinity DataIC50:  1.62E+3nM. Assay description: Inhibition of JAK1 (unknown origin)
In DepthDetails ArticlePubMed
TargetLeucine-rich repeat serine/threonine-protein kinase 2(Homo sapiens (Human))
Pfizer
US Patent
LigandPNGBDBM50059259(CHEMBL3393341 | US9156845, 16)
Affinity DataIC50:  16nM. Assay description: Inhibition of GST-tagged truncated human recombinant LRRK2 using fluorescein-labeled LRRKtide peptide substrate incubated for 2 hrs
In DepthDetails ArticlePubMed
TargetTyrosine-protein kinase JAK3(Homo sapiens (Human))
Pfizer
Curated by ChEMBL
LigandPNGBDBM50059259(CHEMBL3393341 | US9156845, 16)
Affinity DataIC50:  54nM. Assay description: Inhibition of JAK3 (unknown origin)
In DepthDetails ArticlePubMed
TargetLeucine-rich repeat serine/threonine-protein kinase 2(Homo sapiens (Human))
Pfizer
US Patent
LigandPNGBDBM50059259(CHEMBL3393341 | US9156845, 16)
Affinity DataIC50:  210nM. Assay description: Inhibition of full length LRRK2 (unknown origin) expressed in HEK293 cells assessed as reduction in S935 phosphorylation incubated for 90 mins by ELI...
In DepthDetails ArticlePubMed
TargetLeucine-rich repeat serine/threonine-protein kinase 2(Homo sapiens (Human))
Pfizer
US Patent
LigandPNGBDBM50059259(CHEMBL3393341 | US9156845, 16)
Affinity DataIC50:  49nM. Assay description: Inhibition of GST-tagged truncated human recombinant LRRK2 G2019S mutant using fluorescein-labeled LRRKtide peptide substrate incubated for 90 mins
In DepthDetails ArticlePubMed
TargetTyrosine-protein kinase JAK2(Homo sapiens (Human))
Pfizer
Curated by ChEMBL
LigandPNGBDBM50059259(CHEMBL3393341 | US9156845, 16)
Affinity DataIC50:  575nM. Assay description: Inhibition of JAK2 (unknown origin)
In DepthDetails ArticlePubMed