BDBM50059386 2-Methyl-6-phenyl-4-phenylethynyl-1,4-dihydro-pyridine-3,5-dicarboxylic acid 5-tert-butyl ester 3-ethyl ester::CHEMBL85172
SMILES CCOC(=O)C1C(C#Cc2ccccc2)C(C(=O)OC(C)(C)C)=C(N=C1C)c1ccccc1
InChI Key InChIKey=AABPBNJVYVWAJE-UHFFFAOYSA-N
Data  1 KI
  Tab Delimited (TSV)   2D SDfile   Computed 3D by Vconf -m prep SDfile
Find this compound or compounds like it in BindingDB:
Activity Spreadsheet -- Enzyme Inhibition Constant Data from BindingDB
Found 1 hit for monomerid = 50059386
TargetAdenosine receptor A3(Homo sapiens (Human))
National Institute Of Diabetes
Curated by ChEMBL
LigandPNGBDBM50059386(2-Methyl-6-phenyl-4-phenylethynyl-1,4-dihydro-pyri...)
Affinity DataKi:  3.10E+3nM. Assay description: Displacement of specific [125I]-AB-MECA binding at human adenosine A3 receptor.
In DepthDetails ArticlePubMed