BDBM50059468 2-{3-[4-(2-Methoxy-phenyl)-piperazin-1-yl]-propyl}-octahydro-imidazo[1,5-a]pyridine::CHEMBL89380
SMILES COc1ccccc1N1CCN(CCCN2CC3CCCCN3C2)CC1
InChI Key InChIKey=BSELYTAEVFSVSK-UHFFFAOYSA-N
Data  2 KI
  Tab Delimited (TSV)   2D SDfile   Computed 3D by Vconf -m prep SDfile
Find this compound or compounds like it in BindingDB:
Activity Spreadsheet -- Enzyme Inhibition Constant Data from BindingDB
Found 2 hits for monomerid = 50059468
Target5-hydroxytryptamine receptor 1A(Rattus norvegicus (rat))
Universidad Complutense
Curated by ChEMBL
LigandPNGBDBM50059468(2-{3-[4-(2-Methoxy-phenyl)-piperazin-1-yl]-propyl}...)
Affinity DataKi:  13.9nM. Assay description: Binding affinities against 5-hydroxytryptamine 1A receptor using [3H]-8-OH-DPAT as radioligand in rat cerebral cortex membrane
In DepthDetails ArticlePubMed
TargetAlpha-1A adrenergic receptor(Rattus norvegicus (Rat))
Universidad Complutense
Curated by ChEMBL
LigandPNGBDBM50059468(2-{3-[4-(2-Methoxy-phenyl)-piperazin-1-yl]-propyl}...)
Affinity DataKi:  218nM. Assay description: Binding affinities against Alpha-1 adrenergic receptor (alpha1 adrenoceptor) using [3H]-prazosin as radioligand in rat cerebral cortex membrane
In DepthDetails ArticlePubMed