BDBM50059677 CHEMBL3393749
SMILES CCCCCCCCC#CCCCCCCCC(=O)OCC1(CO)C\C(=C\CC(C)C)C(=O)O1
InChI Key InChIKey=NSAORZLENDLHHH-QLYXXIJNSA-N
Data  4 KI
  Tab Delimited (TSV)   2D SDfile   Computed 3D by Vconf -m prep SDfile
Find this compound or compounds like it in BindingDB:
Activity Spreadsheet -- Enzyme Inhibition Constant Data from BindingDB
Found 4 hits for monomerid = 50059677
TargetProtein kinase C epsilon type(Homo sapiens (Human))
Seoul National University
Curated by ChEMBL
LigandPNGBDBM50059677(CHEMBL3393749)
Affinity DataKi:  7.10nM. Assay description: Displacement of [20-3H] phorbol 12, 13-dibutylate from recombinant PKCepsilon (unknown origin) in presence of 100 ug/ml 100% phosphatidylserine
In DepthDetails ArticlePubMed
TargetProtein kinase C alpha type(Homo sapiens (Human))
Seoul National University
Curated by ChEMBL
LigandPNGBDBM50059677(CHEMBL3393749)
Affinity DataKi:  13nM. Assay description: Displacement of [20-3H] phorbol 12, 13-dibutylate from recombinant PKCalpha (unknown origin) in presence of 100 ug/ml 100% phosphatidylserine
In DepthDetails ArticlePubMed
TargetProtein kinase C epsilon type(Homo sapiens (Human))
Seoul National University
Curated by ChEMBL
LigandPNGBDBM50059677(CHEMBL3393749)
Affinity DataKi:  35nM. Assay description: Displacement of [20-3H] phorbol 12, 13-dibutylate from recombinant PKCepsilon (unknown origin) in presence of nuclear membrane mimetic lipid mixture
In DepthDetails ArticlePubMed
TargetProtein kinase C alpha type(Homo sapiens (Human))
Seoul National University
Curated by ChEMBL
LigandPNGBDBM50059677(CHEMBL3393749)
Affinity DataKi:  39nM. Assay description: Displacement of [20-3H] phorbol 12, 13-dibutylate from recombinant PKCalpha (unknown origin) in presence of nuclear membrane mimetic lipid mixture
In DepthDetails ArticlePubMed