BDBM50059718 4-Furan-3-yl-7-[7-(4-hydroxy-tetrahydro-pyran-4-yl)-quinolin-2-ylmethoxy]-naphthalene-2-carbonitrile::CHEMBL421391
SMILES OC1(CCOCC1)c1ccc2ccc(COc3ccc4c(cc(cc4c3)C#N)-c3ccoc3)nc2c1
InChI Key InChIKey=GKYXNCDXXFTVAC-UHFFFAOYSA-N
Data  1 IC50
  Tab Delimited (TSV)   2D SDfile   Computed 3D by Vconf -m prep SDfile
Find this compound or compounds like it in BindingDB:
Activity Spreadsheet -- Enzyme Inhibition Constant Data from BindingDB
Found 1 hit for monomerid = 50059718
TargetPolyunsaturated fatty acid 5-lipoxygenase(Homo sapiens (Human))
Merck Frosst Centre For Therapeutic Research
Curated by ChEMBL
LigandPNGBDBM50059718(4-Furan-3-yl-7-[7-(4-hydroxy-tetrahydro-pyran-4-yl...)
Affinity DataIC50:  1.00E+3nM. Assay description: Inhibition of oxidation of arachidonic acid by human 5-Lipoxygenase using spectrophotometric assay
In DepthDetails ArticlePubMed