BDBM50059891 1-amino-2-(3,4,5-trimethoxyphenyl)ethane::2-(3,4,5-trimethoxyphenyl)ethanamine::3,4,5-trimethoxybenzeneethanamine::3,4,5-trimethoxyphenethylamine::3,4,5-trimethoxyphenylethylamine::CHEMBL26687::Mescalin::Meskalin::TMPEA::mescalina::mescaline::mezcalina
SMILES COc1cc(CCN)cc(OC)c1OC
InChI Key InChIKey=RHCSKNNOAZULRK-UHFFFAOYSA-N
Data  10 KI  4 EC50
  Tab Delimited (TSV)   2D SDfile   Computed 3D by Vconf -m prep SDfile
Find this compound or compounds like it in BindingDB:
Activity Spreadsheet -- Enzyme Inhibition Constant Data from BindingDB
Found 14 hits for monomerid = 50059891
Target5-hydroxytryptamine receptor 2A(Rattus norvegicus (rat))
Stanford University
Curated by PDSP Ki Database
LigandPNGBDBM50059891(1-amino-2-(3,4,5-trimethoxyphenyl)ethane | 2-(3,4,...)
Affinity DataKi:  150nM
In DepthDetails PubMed
Target5-hydroxytryptamine receptor 2C(Homo sapiens (Human))
Purdue University
Curated by ChEMBL
LigandPNGBDBM50059891(1-amino-2-(3,4,5-trimethoxyphenyl)ethane | 2-(3,4,...)
Affinity DataKi:  303nM. Assay description: Agonist activity at cloned human 5-hydroxytryptamine 2C receptor using [125I]-DOI radioligand
In DepthDetails ArticlePubMed
Target5-hydroxytryptamine receptor 2A(Rattus norvegicus (rat))
Stanford University
Curated by PDSP Ki Database
LigandPNGBDBM50059891(1-amino-2-(3,4,5-trimethoxyphenyl)ethane | 2-(3,4,...)
Affinity DataKi:  360nM. Assay description: Displacement of [125I]DOI from rat 5HT2A receptor
In DepthDetails ArticlePubMed
Target5-hydroxytryptamine receptor 2C(Rattus norvegicus (Rat))
Purdue University
Curated by ChEMBL
LigandPNGBDBM50059891(1-amino-2-(3,4,5-trimethoxyphenyl)ethane | 2-(3,4,...)
Affinity DataKi:  380nM. Assay description: Displacement of [125I]DOI from rat 5HT2C receptor
In DepthDetails ArticlePubMed
Target5-hydroxytryptamine receptor 2A(Homo sapiens (Human))
Purdue University
Curated by ChEMBL
LigandPNGBDBM50059891(1-amino-2-(3,4,5-trimethoxyphenyl)ethane | 2-(3,4,...)
Affinity DataKi:  551nM. Assay description: Agonist activity at cloned human 5-hydroxytryptamine 2A receptor using [125I]-DOI radioligand
In DepthDetails ArticlePubMed
Target5-hydroxytryptamine receptor 2B(Homo sapiens (Human))
Purdue University
Curated by ChEMBL
LigandPNGBDBM50059891(1-amino-2-(3,4,5-trimethoxyphenyl)ethane | 2-(3,4,...)
Affinity DataKi:  795nM. Assay description: Agonist activity at cloned human 5-hydroxytryptamine 2B receptor using [3H]-5-HT radioligand
In DepthDetails ArticlePubMed
Target5-hydroxytryptamine receptor 2A(Rattus norvegicus (rat))
Stanford University
Curated by PDSP Ki Database
LigandPNGBDBM50059891(1-amino-2-(3,4,5-trimethoxyphenyl)ethane | 2-(3,4,...)
Affinity DataKi:  5.50E+3nM. Assay description: Ability to displace [3H]-ketanserin from rat cortical homogenate 5-hydroxytryptamine 2A receptor
In DepthDetails ArticlePubMed
Target5-hydroxytryptamine receptor 2A(Rattus norvegicus (rat))
Stanford University
Curated by PDSP Ki Database
LigandPNGBDBM50059891(1-amino-2-(3,4,5-trimethoxyphenyl)ethane | 2-(3,4,...)
Affinity DataKi:  5.50E+3nM. Assay description: Displacement of [3H]ketanserin from 5HT2A receptor in Sprague-Dawley rat brain by liquid scintillation spectroscopy
In DepthDetails ArticlePubMed
Target5-hydroxytryptamine receptor 1A(Rattus norvegicus (rat))
Purdue University
Curated by ChEMBL
LigandPNGBDBM50059891(1-amino-2-(3,4,5-trimethoxyphenyl)ethane | 2-(3,4,...)
Affinity DataKi:  6.90E+3nM. Assay description: Ability to displace [3H]-8-OH-DPAT from rat hippocampal homogenate 5-hydroxytryptamine 1A receptor
In DepthDetails ArticlePubMed
Target5-hydroxytryptamine receptor 2B(BOVINE)
Stanford University
Curated by PDSP Ki Database
LigandPNGBDBM50059891(1-amino-2-(3,4,5-trimethoxyphenyl)ethane | 2-(3,4,...)
Affinity DataKi: >1.00E+4nM
In DepthDetails PubMed
Target5-hydroxytryptamine receptor 2A(Rattus norvegicus (rat))
Stanford University
Curated by PDSP Ki Database
LigandPNGBDBM50059891(1-amino-2-(3,4,5-trimethoxyphenyl)ethane | 2-(3,4,...)
Affinity DataEC50:  1.13E+4nM. Assay description: Activity at rat 5HT2A receptor assessed as 5HT-stimulated IP3 accumulation
In DepthDetails ArticlePubMed
Target5-hydroxytryptamine receptor 2A(Rattus norvegicus (rat))
Stanford University
Curated by PDSP Ki Database
LigandPNGBDBM50059891(1-amino-2-(3,4,5-trimethoxyphenyl)ethane | 2-(3,4,...)
Affinity DataEC50:  2.60E+3nM. Assay description: Tested for its ability to activate phospholipase c by quantification of IP3 at cloned rat 5-hydroxytryptamine 2A receptor
In DepthDetails ArticlePubMed
Target5-hydroxytryptamine receptor 2C(Rattus norvegicus (Rat))
Purdue University
Curated by ChEMBL
LigandPNGBDBM50059891(1-amino-2-(3,4,5-trimethoxyphenyl)ethane | 2-(3,4,...)
Affinity DataEC50:  2.40E+4nM. Assay description: Effect on phosphoinositide hydrolysis in NIH 3T3 fibroblast 5-hydroxytryptamine 2C receptor
In DepthDetails ArticlePubMed
Target5-hydroxytryptamine receptor 2A(Rattus norvegicus (rat))
Stanford University
Curated by PDSP Ki Database
LigandPNGBDBM50059891(1-amino-2-(3,4,5-trimethoxyphenyl)ethane | 2-(3,4,...)
Affinity DataEC50:  4.00E+3nM. Assay description: Effect on phosphoinositide hydrolysis in NIH 3T3 fibroblast 5-hydroxytryptamine 2A receptor
In DepthDetails ArticlePubMed