BDBM50060105 2-[8-Chloro-2-(4-chloro-phenyl)-6-trifluoromethyl-imidazo[1,2-a]pyridin-3-yl]-N,N-dipropyl-acetamide::CHEMBL104686
SMILES CCCN(CCC)C(=O)Cc1c(nc2c(Cl)cc(cn12)C(F)(F)F)-c1ccc(Cl)cc1
InChI Key InChIKey=XSYYUVNSBNMFQP-UHFFFAOYSA-N
Data  3 IC50
  Tab Delimited (TSV)   2D SDfile   Computed 3D by Vconf -m prep SDfile
Find this compound or compounds like it in BindingDB:
Activity Spreadsheet -- Enzyme Inhibition Constant Data from BindingDB
Found 3 hits for monomerid = 50060105
TargetTranslocator protein(Rattus norvegicus (rat))
Universit£
Curated by ChEMBL
LigandPNGBDBM50060105(2-[8-Chloro-2-(4-chloro-phenyl)-6-trifluoromethyl-...)
Affinity DataIC50:  37nM. Assay description: Displacement of Ro 5-4864 from peripheral (renal cell) Benzodiazepine receptor
In DepthDetails ArticlePubMed
TargetTranslocator protein(Rattus norvegicus (rat))
Universit£
Curated by ChEMBL
LigandPNGBDBM50060105(2-[8-Chloro-2-(4-chloro-phenyl)-6-trifluoromethyl-...)
Affinity DataIC50:  1.82nM. Assay description: Displacement of [3H]-PK 11195 from peripheral-type benzodiazepine receptor of rat cerebral cortex membranes
In DepthDetails ArticlePubMed
TargetTranslocator protein(Rattus norvegicus (rat))
Universit£
Curated by ChEMBL
LigandPNGBDBM50060105(2-[8-Chloro-2-(4-chloro-phenyl)-6-trifluoromethyl-...)
Affinity DataIC50:  2.82nM. Assay description: Displacement of [3H]-PK 11195 from peripheral-type benzodiazepine receptor of rat ovary membranes
In DepthDetails ArticlePubMed